{"text_format":"1","workbook":"xlsx","n_sheets":8,"sheets":["Interface","Updates","Descriptions","Selection Lists","Valve Data","Calculations","Max Inlet Pressure","Steam Table"],"not_rendered":{"charts":0,"images":0,"macros":1,"external_links":0,"defined_names":10,"comments":0,"pivot_tables":0},"unopened":[],"bounds":{"document_bytes":16777216,"sheet_cells":100000,"rows_first":2000,"rows_last":500,"rows_between":2000,"halvings":0,"cell_chars":16384,"cell_head_chars":4096},"cells_cut":0,"cells_raw":0,"read":"whole","date_system":"1900"}

{"sheet":"Interface","index":0,"n_rows":60,"n_cols":9,"rows_kept":60,"cut":false,"hidden":false,"merged":[[10,3,13,4],[48,3,48,5],[51,4,51,5],[52,4,52,5],[54,3,54,5]]}
[]
[null,null,null,"SCC Water / Steam Valve Sizing Program","Price List"]
[null,null,null,"Revision 1.2","Sizing Only"]
[]
[null,null,"Hide","Customer:"]
[null,null,"Hide","Attn:"]
[null,null,"Hide","Quote Date:"]
[null,null,"Hide","Quote Maker Initials:"]
[null,null,"Hide","Quote Number Today:"]
[null,null,"Hide","Total Number of Systems:"]
{"$rows_left_out":51}
{"sheet":"Updates","index":1,"n_rows":5,"n_cols":2,"rows_kept":5,"cut":false,"hidden":true,"merged":[[4,0,4,1]]}
["Update Number","Update Description"]
[1,"Currently 2-1/2\" and 3\" 599 valves are automatically given an SKC62UA actuator which is incorrect.  Update so that if the valve is 599 and under 4\", it checks for SKB, C, and D."]
[2,"Remove 1.15 from BHP calculation.  This was a 15% safety factor.  10% safety factor is already built in elsewhere."]
[3,"Change safety factor from 10% to 50%."]
["Revision 1.2 released 9/17/2021"]

{"sheet":"Descriptions","index":2,"n_rows":500,"n_cols":2,"rows_kept":500,"cut":false,"hidden":true,"merged":[]}
["SCC Part Number","Description"]
["599-03072","2-way NC 1/2\" NPT 1.0 Cv linear valve steam packing"]
["599-03073","2-way NC 1/2\" NPT 1.6 Cv linear valve steam packing"]
["599-03074","2-way NC 1/2\" NPT 2.5 Cv linear valve steam packing"]
["599-03075","2-way NC 1/2\" NPT 4.0 Cv linear valve steam packing"]
["599-03076","2-way NC 3/4\" NPT linear valve steam packing"]
["599-03077","2-way NC 1\" NPT linear valve steam packing"]
["599-03078","2-way NC 1-1/4\" NPT linear valve steam packing"]
["599-03079","2-way NC 1-1/2\" NPT linear valve steam packing"]
["599-03080","2-way NC 2\" NPT linear valve steam packing"]
{"$rows_left_out":491}
{"sheet":"Selection Lists","index":3,"n_rows":5,"n_cols":4,"rows_kept":5,"cut":false,"hidden":true,"merged":[]}
[]
[null,"AllValvesHFV","LargeValvesHFV","LargeValves599"]
[null,"NPT threaded","150# flanged","125# flanged"]
[null,"150# flanged","300# flanged","250# flanged"]
[null,"300# flanged"]

{"sheet":"Valve Data","index":4,"n_rows":53,"n_cols":18,"rows_kept":53,"cut":false,"hidden":true,"merged":[]}
["Valve Part Number","Valve Size","Valve Size Decimal","Cavitation Adapter","Cavitation Adapter Cv","Cv","Max Flow at 100% Open (gpm)","Max Flow at 100% Open (lb/hr)","Intermediate Pressure (psia)","Cv OK?","Valve Cavitation Index","Adapter Cavitation Index","Minimum Cavitation Index","Index Ranking","Good Valve - No Cavitation","Best Valve - Cavitation","SKD Closeoff Pressure","SKB/C Closeoff Pressure"]
["HFV-xxx-050R-3","1/2\" Reduced",0.5,"CA123",1.6,1.9,{"$f":"ValveData[[#This Row],[Cv]]*SQRT((Interface!$E$34-Interface!$E$35)/Calculations!$B$3)","v":{"$error":"#N/A"}},{"$f":"ValveData[[#This Row],[Cv]]*63.3*(1-((Interface!$E$34-Interface!$E$35)/(1.944*(Interface!$E$34+14.7))))*SQRT((Interface!$E$34-Interface!$E$35)*Calculations!$B$9)","v":0},{"$f":"IF(ValveData[[#This Row],[Cavitation Adapter]]=\"None\",\"N/A\",2.43*(Calculations!$B$5/ValveData[[#This Row],[Cavitation Adapter Cv]])^2+Interface!$E$35)","v":{"$error":"#VALUE!"}},{"$f":"IF(ValveData[[#This Row],[Cv]]>Calculations!$B$10,\"Yes\",\"No\")","v":"No"},{"$f":"IF(D2=\"None\",\"N/A\",(Interface!$E$34-(Calculations!$B$4-14.7))/(Interface!$E$34-ValveData[[#This Row],[Intermediate Pressure (psia)]]))","v":{"$error":"#N/A"}},{"$f":"IF(D2=\"None\",\"N/A\",(ValveData[[#This Row],[Intermediate Pressure (psia)]]-(Calculations!$B$4-14.7))/(ValveData[[#This Row],[Intermediate Pressure (psia)]]-Interface!$E$35))","v":{"$error":"#VALUE!"}},{"$f":"IF(AND(ValveData[[#This Row],[Valve Cavitation Index]]>2,ValveData[[#This Row],[Adapter Cavitation Index]]>2),MIN(ValveData[[#This Row],[Valve Cavitation Index]:[Adapter Cavitation Index]]),0)","v":{"$error":"#N/A"}},{"$f":"RANK(M2,$M$2:$M$5)","v":{"$error":"#N/A"}},{"$f":"IF(AND(ValveData[[#This Row],[Cavitation Adapter]]=\"None\",ValveData[[#This Row],[Cv OK?]]=\"Yes\"),\"Yes\",\"No\")","v":"No"},{"$f":"IF(AND(ValveData[[#This Row],[Cv OK?]]=\"Yes\",ValveData[[#This Row],[Minimum Cavitation Index]]>2,ValveData[[#This Row],[Index Ranking]]=1),\"Yes\",\"No\")","v":{"$error":"#N/A"}},290,720]
["HFV-xxx-050R-2","1/2\" Reduced",0.5,"CA122",2.4,2.2000000000000002,{"$f":"ValveData[[#This Row],[Cv]]*SQRT((Interface!$E$34-Interface!$E$35)/Calculations!$B$3)","v":{"$error":"#N/A"}},{"$f":"ValveData[[#This Row],[Cv]]*63.3*(1-((Interface!$E$34-Interface!$E$35)/(1.944*(Interface!$E$34+14.7))))*SQRT((Interface!$E$34-Interface!$E$35)*Calculations!$B$9)","v":0},{"$f":"IF(ValveData[[#This Row],[Cavitation Adapter]]=\"None\",\"N/A\",2.43*(Calculations!$B$5/ValveData[[#This Row],[Cavitation Adapter Cv]])^2+Interface!$E$35)","v":{"$error":"#VALUE!"}},{"$f":"IF(ValveData[[#This Row],[Cv]]>Calculations!$B$10,\"Yes\",\"No\")","v":"No"},{"$f":"IF(D3=\"None\",\"N/A\",(Interface!$E$34-(Calculations!$B$4-14.7))/(Interface!$E$34-ValveData[[#This Row],[Intermediate Pressure (psia)]]))","v":{"$error":"#N/A"}},{"$f":"IF(D3=\"None\",\"N/A\",(ValveData[[#This Row],[Intermediate Pressure (psia)]]-(Calculations!$B$4-14.7))/(ValveData[[#This Row],[Intermediate Pressure (psia)]]-Interface!$E$35))","v":{"$error":"#VALUE!"}},{"$f":"IF(AND(ValveData[[#This Row],[Valve Cavitation Index]]>2,ValveData[[#This Row],[Adapter Cavitation Index]]>2),MIN(ValveData[[#This Row],[Valve Cavitation Index]:[Adapter Cavitation Index]]),0)","v":{"$error":"#N/A"}},{"$f":"RANK(M3,$M$2:$M$5)","v":{"$error":"#N/A"}},{"$f":"IF(AND(ValveData[[#This Row],[Cavitation Adapter]]=\"None\",ValveData[[#This Row],[Cv OK?]]=\"Yes\"),\"Yes\",\"No\")","v":"No"},{"$f":"IF(AND(ValveData[[#This Row],[Cv OK?]]=\"Yes\",ValveData[[#This Row],[Minimum Cavitation Index]]>2,ValveData[[#This Row],[Index Ranking]]=1),\"Yes\",\"No\")","v":{"$error":"#N/A"}},290,720]
["HFV-xxx-050R-1","1/2\" Reduced",0.5,"CA121",3.6,2.7,{"$f":"ValveData[[#This Row],[Cv]]*SQRT((Interface!$E$34-Interface!$E$35)/Calculations!$B$3)","v":{"$error":"#N/A"}},{"$f":"ValveData[[#This Row],[Cv]]*63.3*(1-((Interface!$E$34-Interface!$E$35)/(1.944*(Interface!$E$34+14.7))))*SQRT((Interface!$E$34-Interface!$E$35)*Calculations!$B$9)","v":0},{"$f":"IF(ValveData[[#This Row],[Cavitation Adapter]]=\"None\",\"N/A\",2.43*(Calculations!$B$5/ValveData[[#This Row],[Cavitation Adapter Cv]])^2+Interface!$E$35)","v":{"$error":"#VALUE!"}},{"$f":"IF(ValveData[[#This Row],[Cv]]>Calculations!$B$10,\"Yes\",\"No\")","v":"No"},{"$f":"IF(D4=\"None\",\"N/A\",(Interface!$E$34-(Calculations!$B$4-14.7))/(Interface!$E$34-ValveData[[#This Row],[Intermediate Pressure (psia)]]))","v":{"$error":"#N/A"}},{"$f":"IF(D4=\"None\",\"N/A\",(ValveData[[#This Row],[Intermediate Pressure (psia)]]-(Calculations!$B$4-14.7))/(ValveData[[#This Row],[Intermediate Pressure (psia)]]-Interface!$E$35))","v":{"$error":"#VALUE!"}},{"$f":"IF(AND(ValveData[[#This Row],[Valve Cavitation Index]]>2,ValveData[[#This Row],[Adapter Cavitation Index]]>2),MIN(ValveData[[#This Row],[Valve Cavitation Index]:[Adapter Cavitation Index]]),0)","v":{"$error":"#N/A"}},{"$error":"#N/A"},{"$f":"IF(AND(ValveData[[#This Row],[Cavitation Adapter]]=\"None\",ValveData[[#This Row],[Cv OK?]]=\"Yes\"),\"Yes\",\"No\")","v":"No"},{"$f":"IF(AND(ValveData[[#This Row],[Cv OK?]]=\"Yes\",ValveData[[#This Row],[Minimum Cavitation Index]]>2,ValveData[[#This Row],[Index Ranking]]=1),\"Yes\",\"No\")","v":{"$error":"#N/A"}},290,720]
["HFV-xxx-050R-X","1/2\" Reduced",0.5,"None","N/A",3.5,{"$f":"ValveData[[#This Row],[Cv]]*SQRT((Interface!$E$34-Interface!$E$35)/Calculations!$B$3)","v":{"$error":"#N/A"}},{"$f":"ValveData[[#This Row],[Cv]]*63.3*(1-((Interface!$E$34-Interface!$E$35)/(1.944*(Interface!$E$34+14.7))))*SQRT((Interface!$E$34-Interface!$E$35)*Calculations!$B$9)","v":0},{"$f":"IF(ValveData[[#This Row],[Cavitation Adapter]]=\"None\",\"N/A\",2.43*(Calculations!$B$5/ValveData[[#This Row],[Cavitation Adapter Cv]])^2+Interface!$E$35)","v":"N/A"},{"$f":"IF(ValveData[[#This Row],[Cv]]>Calculations!$B$10,\"Yes\",\"No\")","v":"No"},{"$f":"IF(D5=\"None\",\"N/A\",(Interface!$E$34-(Calculations!$B$4-14.7))/(Interface!$E$34-ValveData[[#This Row],[Intermediate Pressure (psia)]]))","v":"N/A"},{"$f":"IF(D5=\"None\",\"N/A\",(ValveData[[#This Row],[Intermediate Pressure (psia)]]-(Calculations!$B$4-14.7))/(ValveData[[#This Row],[Intermediate Pressure (psia)]]-Interface!$E$35))","v":"N/A"},{"$f":"IF(AND(ValveData[[#This Row],[Valve Cavitation Index]]>2,ValveData[[#This Row],[Adapter Cavitation Index]]>2),MIN(ValveData[[#This Row],[Valve Cavitation Index]:[Adapter Cavitation Index]]),0)","v":0},0,{"$f":"IF(AND(ValveData[[#This Row],[Cavitation Adapter]]=\"None\",ValveData[[#This Row],[Cv OK?]]=\"Yes\"),\"Yes\",\"No\")","v":"No"},{"$f":"IF(AND(ValveData[[#This Row],[Cv OK?]]=\"Yes\",ValveData[[#This Row],[Minimum Cavitation Index]]>2,ValveData[[#This Row],[Index Ranking]]=1),\"Yes\",\"No\")","v":"No"},290,720]
["HFV-xxx-050-3","1/2\"",0.5,"CA123",1.6,2.5,{"$f":"ValveData[[#This Row],[Cv]]*SQRT((Interface!$E$34-Interface!$E$35)/Calculations!$B$3)","v":{"$error":"#N/A"}},{"$f":"ValveData[[#This Row],[Cv]]*63.3*(1-((Interface!$E$34-Interface!$E$35)/(1.944*(Interface!$E$34+14.7))))*SQRT((Interface!$E$34-Interface!$E$35)*Calculations!$B$9)","v":0},{"$f":"IF(ValveData[[#This Row],[Cavitation Adapter]]=\"None\",\"N/A\",2.43*(Calculations!$B$5/ValveData[[#This Row],[Cavitation Adapter Cv]])^2+Interface!$E$35)","v":{"$error":"#VALUE!"}},{"$f":"IF(ValveData[[#This Row],[Cv]]>Calculations!$B$10,\"Yes\",\"No\")","v":"No"},{"$f":"IF(D6=\"None\",\"N/A\",(Interface!$E$34-(Calculations!$B$4-14.7))/(Interface!$E$34-ValveData[[#This Row],[Intermediate Pressure (psia)]]))","v":{"$error":"#N/A"}},{"$f":"IF(D6=\"None\",\"N/A\",(ValveData[[#This Row],[Intermediate Pressure (psia)]]-(Calculations!$B$4-14.7))/(ValveData[[#This Row],[Intermediate Pressure (psia)]]-Interface!$E$35))","v":{"$error":"#VALUE!"}},{"$f":"IF(AND(ValveData[[#This Row],[Valve Cavitation Index]]>2,ValveData[[#This Row],[Adapter Cavitation Index]]>2),MIN(ValveData[[#This Row],[Valve Cavitation Index]:[Adapter Cavitation Index]]),0)","v":{"$error":"#N/A"}},{"$f":"RANK(M6,$M$6:$M$9)","v":{"$error":"#N/A"}},{"$f":"IF(AND(ValveData[[#This Row],[Cavitation Adapter]]=\"None\",ValveData[[#This Row],[Cv OK?]]=\"Yes\"),\"Yes\",\"No\")","v":"No"},{"$f":"IF(AND(ValveData[[#This Row],[Cv OK?]]=\"Yes\",ValveData[[#This Row],[Minimum Cavitation Index]]>2,ValveData[[#This Row],[Index Ranking]]=1),\"Yes\",\"No\")","v":{"$error":"#N/A"}},290,720]
["HFV-xxx-050-2","1/2\"",0.5,"CA122",2.4,2.8,{"$f":"ValveData[[#This Row],[Cv]]*SQRT((Interface!$E$34-Interface!$E$35)/Calculations!$B$3)","v":{"$error":"#N/A"}},{"$f":"ValveData[[#This Row],[Cv]]*63.3*(1-((Interface!$E$34-Interface!$E$35)/(1.944*(Interface!$E$34+14.7))))*SQRT((Interface!$E$34-Interface!$E$35)*Calculations!$B$9)","v":0},{"$f":"IF(ValveData[[#This Row],[Cavitation Adapter]]=\"None\",\"N/A\",2.43*(Calculations!$B$5/ValveData[[#This Row],[Cavitation Adapter Cv]])^2+Interface!$E$35)","v":{"$error":"#VALUE!"}},{"$f":"IF(ValveData[[#This Row],[Cv]]>Calculations!$B$10,\"Yes\",\"No\")","v":"No"},{"$f":"IF(D7=\"None\",\"N/A\",(Interface!$E$34-(Calculations!$B$4-14.7))/(Interface!$E$34-ValveData[[#This Row],[Intermediate Pressure (psia)]]))","v":{"$error":"#N/A"}},{"$f":"IF(D7=\"None\",\"N/A\",(ValveData[[#This Row],[Intermediate Pressure (psia)]]-(Calculations!$B$4-14.7))/(ValveData[[#This Row],[Intermediate Pressure (psia)]]-Interface!$E$35))","v":{"$error":"#VALUE!"}},{"$f":"IF(AND(ValveData[[#This Row],[Valve Cavitation Index]]>2,ValveData[[#This Row],[Adapter Cavitation Index]]>2),MIN(ValveData[[#This Row],[Valve Cavitation Index]:[Adapter Cavitation Index]]),0)","v":{"$error":"#N/A"}},{"$f":"RANK(M7,$M$6:$M$9)","v":{"$error":"#N/A"}},{"$f":"IF(AND(ValveData[[#This Row],[Cavitation Adapter]]=\"None\",ValveData[[#This Row],[Cv OK?]]=\"Yes\"),\"Yes\",\"No\")","v":"No"},{"$f":"IF(AND(ValveData[[#This Row],[Cv OK?]]=\"Yes\",ValveData[[#This Row],[Minimum Cavitation Index]]>2,ValveData[[#This Row],[Index Ranking]]=1),\"Yes\",\"No\")","v":{"$error":"#N/A"}},290,720]
["HFV-xxx-050-1","1/2\"",0.5,"CA121",3.6,3.2,{"$f":"ValveData[[#This Row],[Cv]]*SQRT((Interface!$E$34-Interface!$E$35)/Calculations!$B$3)","v":{"$error":"#N/A"}},{"$f":"ValveData[[#This Row],[Cv]]*63.3*(1-((Interface!$E$34-Interface!$E$35)/(1.944*(Interface!$E$34+14.7))))*SQRT((Interface!$E$34-Interface!$E$35)*Calculations!$B$9)","v":0},{"$f":"IF(ValveData[[#This Row],[Cavitation Adapter]]=\"None\",\"N/A\",2.43*(Calculations!$B$5/ValveData[[#This Row],[Cavitation Adapter Cv]])^2+Interface!$E$35)","v":{"$error":"#VALUE!"}},{"$f":"IF(ValveData[[#This Row],[Cv]]>Calculations!$B$10,\"Yes\",\"No\")","v":"No"},{"$f":"IF(D8=\"None\",\"N/A\",(Interface!$E$34-(Calculations!$B$4-14.7))/(Interface!$E$34-ValveData[[#This Row],[Intermediate Pressure (psia)]]))","v":{"$error":"#N/A"}},{"$f":"IF(D8=\"None\",\"N/A\",(ValveData[[#This Row],[Intermediate Pressure (psia)]]-(Calculations!$B$4-14.7))/(ValveData[[#This Row],[Intermediate Pressure (psia)]]-Interface!$E$35))","v":{"$error":"#VALUE!"}},{"$f":"IF(AND(ValveData[[#This Row],[Valve Cavitation Index]]>2,ValveData[[#This Row],[Adapter Cavitation Index]]>2),MIN(ValveData[[#This Row],[Valve Cavitation Index]:[Adapter Cavitation Index]]),0)","v":{"$error":"#N/A"}},{"$error":"#N/A"},{"$f":"IF(AND(ValveData[[#This Row],[Cavitation Adapter]]=\"None\",ValveData[[#This Row],[Cv OK?]]=\"Yes\"),\"Yes\",\"No\")","v":"No"},{"$f":"IF(AND(ValveData[[#This Row],[Cv OK?]]=\"Yes\",ValveData[[#This Row],[Minimum Cavitation Index]]>2,ValveData[[#This Row],[Index Ranking]]=1),\"Yes\",\"No\")","v":{"$error":"#N/A"}},290,720]
["HFV-xxx-050-X","1/2\"",0.5,"None","N/A",5,{"$f":"ValveData[[#This Row],[Cv]]*SQRT((Interface!$E$34-Interface!$E$35)/Calculations!$B$3)","v":{"$error":"#N/A"}},{"$f":"ValveData[[#This Row],[Cv]]*63.3*(1-((Interface!$E$34-Interface!$E$35)/(1.944*(Interface!$E$34+14.7))))*SQRT((Interface!$E$34-Interface!$E$35)*Calculations!$B$9)","v":0},{"$f":"IF(ValveData[[#This Row],[Cavitation Adapter]]=\"None\",\"N/A\",2.43*(Calculations!$B$5/ValveData[[#This Row],[Cavitation Adapter Cv]])^2+Interface!$E$35)","v":"N/A"},{"$f":"IF(ValveData[[#This Row],[Cv]]>Calculations!$B$10,\"Yes\",\"No\")","v":"No"},{"$f":"IF(D9=\"None\",\"N/A\",(Interface!$E$34-(Calculations!$B$4-14.7))/(Interface!$E$34-ValveData[[#This Row],[Intermediate Pressure (psia)]]))","v":"N/A"},{"$f":"IF(D9=\"None\",\"N/A\",(ValveData[[#This Row],[Intermediate Pressure (psia)]]-(Calculations!$B$4-14.7))/(ValveData[[#This Row],[Intermediate Pressure (psia)]]-Interface!$E$35))","v":"N/A"},{"$f":"IF(AND(ValveData[[#This Row],[Valve Cavitation Index]]>2,ValveData[[#This Row],[Adapter Cavitation Index]]>2),MIN(ValveData[[#This Row],[Valve Cavitation Index]:[Adapter Cavitation Index]]),0)","v":0},0,{"$f":"IF(AND(ValveData[[#This Row],[Cavitation Adapter]]=\"None\",ValveData[[#This Row],[Cv OK?]]=\"Yes\"),\"Yes\",\"No\")","v":"No"},{"$f":"IF(AND(ValveData[[#This Row],[Cv OK?]]=\"Yes\",ValveData[[#This Row],[Minimum Cavitation Index]]>2,ValveData[[#This Row],[Index Ranking]]=1),\"Yes\",\"No\")","v":"No"},290,720]
["HFV-xxx-075-3","3/4\"",0.75,"CA133",3.8,3.9,{"$f":"ValveData[[#This Row],[Cv]]*SQRT((Interface!$E$34-Interface!$E$35)/Calculations!$B$3)","v":{"$error":"#N/A"}},{"$f":"ValveData[[#This Row],[Cv]]*63.3*(1-((Interface!$E$34-Interface!$E$35)/(1.944*(Interface!$E$34+14.7))))*SQRT((Interface!$E$34-Interface!$E$35)*Calculations!$B$9)","v":0},{"$f":"IF(ValveData[[#This Row],[Cavitation Adapter]]=\"None\",\"N/A\",2.43*(Calculations!$B$5/ValveData[[#This Row],[Cavitation Adapter Cv]])^2+Interface!$E$35)","v":{"$error":"#VALUE!"}},{"$f":"IF(ValveData[[#This Row],[Cv]]>Calculations!$B$10,\"Yes\",\"No\")","v":"No"},{"$f":"IF(D10=\"None\",\"N/A\",(Interface!$E$34-(Calculations!$B$4-14.7))/(Interface!$E$34-ValveData[[#This Row],[Intermediate Pressure (psia)]]))","v":{"$error":"#N/A"}},{"$f":"IF(D10=\"None\",\"N/A\",(ValveData[[#This Row],[Intermediate Pressure (psia)]]-(Calculations!$B$4-14.7))/(ValveData[[#This Row],[Intermediate Pressure (psia)]]-Interface!$E$35))","v":{"$error":"#VALUE!"}},{"$f":"IF(AND(ValveData[[#This Row],[Valve Cavitation Index]]>2,ValveData[[#This Row],[Adapter Cavitation Index]]>2),MIN(ValveData[[#This Row],[Valve Cavitation Index]:[Adapter Cavitation Index]]),0)","v":{"$error":"#N/A"}},{"$f":"RANK(M10,$M$10:$M$13)","v":{"$error":"#N/A"}},{"$f":"IF(AND(ValveData[[#This Row],[Cavitation Adapter]]=\"None\",ValveData[[#This Row],[Cv OK?]]=\"Yes\"),\"Yes\",\"No\")","v":"No"},{"$f":"IF(AND(ValveData[[#This Row],[Cv OK?]]=\"Yes\",ValveData[[#This Row],[Minimum Cavitation Index]]>2,ValveData[[#This Row],[Index Ranking]]=1),\"Yes\",\"No\")","v":{"$error":"#N/A"}},290,720]
{"$rows_left_out":44}
{"sheet":"Calculations","index":5,"n_rows":30,"n_cols":2,"rows_kept":30,"cut":false,"hidden":true,"merged":[]}
["Variable","Value"]
["Valve Series",{"$f":"IF(Interface!E17=\"599… series\",\"599\",IF(Interface!E17=\"HFV… series\",\"HFV\",IF(AND(Interface!E17=\"Auto select\",(Interface!E34-Interface!E35)>50),\"HFV\",IF(AND(Interface!E17=\"Auto select\",(Interface!E34-Interface!E35)<=50),\"599\",\"\"))))","v":""}]
["Specific Gravity",{"$f":"IFERROR(VLOOKUP(Interface!E39,'Steam Table'!A2:H99,4,FALSE),AVERAGE(OFFSET(INDEX('Steam Table'!D2:D99,MATCH(Interface!E39,'Steam Table'!A2:A99,1)),0,0,2,1)))","v":{"$error":"#N/A"}}]
["Vapor Pressure",{"$f":"IFERROR(VLOOKUP(Interface!E39,'Steam Table'!A2:H99,6,FALSE),AVERAGE(OFFSET(INDEX('Steam Table'!F2:F99,MATCH(Interface!E39,'Steam Table'!A2:A99,1)),0,0,2,1)))","v":{"$error":"#N/A"}}]
["Required gpm for Application",{"$f":"IF(Interface!C20=\"Show\",Interface!E20,IF(Interface!C22=\"Show\",Interface!I22,IF(Interface!C26=\"Show\",Interface!I26,IF(Interface!C30=\"Show\",Interface!I30,\"N/A\"))))","v":"N/A"}]
["Steam Enthalpy",{"$f":"IFERROR(VLOOKUP(Interface!E35,'Steam Table'!E2:H99,3,TRUE),AVERAGE(OFFSET(INDEX('Steam Table'!E2:E99,MATCH(Interface!E35,'Steam Table'!E2:E99,1)),0,0,2,1)))","v":1150.5}]
["Water Enthalpy",{"$f":"IFERROR(VLOOKUP(Interface!E39,'Steam Table'!A2:H99,2,FALSE),AVERAGE(OFFSET(INDEX('Steam Table'!B2:B99,MATCH(Interface!E39,'Steam Table'!A2:A99,1)),0,0,2,1)))","v":{"$error":"#N/A"}}]
["Water Density",{"$f":"IFERROR(VLOOKUP(Interface!E39,'Steam Table'!A2:H99,3,FALSE),AVERAGE(OFFSET(INDEX('Steam Table'!C2:C99,MATCH(Interface!E39,'Steam Table'!A2:A99,1)),0,0,2,1)))","v":{"$error":"#N/A"}}]
["Steam Density",{"$f":"IFERROR(VLOOKUP(Interface!E34,'Steam Table'!E2:H99,8,TRUE),AVERAGE(OFFSET(INDEX('Steam Table'!H2:H99,MATCH(Interface!E34,'Steam Table'!E2:E99,1)),0,0,2,1)))","v":3.875E-2}]
["Required Cv for Application with 50% Safety Factor",{"$f":"IF(Interface!E18=\"Water\",Calculations!B5/SQRT((Interface!E34-Interface!E35)/B3)*1.5,IF(Interface!E18=\"Steam\",Interface!E32/63.3/(1-((Interface!E34-Interface!E35)/(1.944*(Interface!E34+14.7))))/(SQRT((Interface!E34-Interface!E35)*B9))*1.5,\"N/A\"))","v":"N/A"}]
{"$rows_left_out":21}
{"sheet":"Max Inlet Pressure","index":6,"n_rows":28,"n_cols":5,"rows_kept":28,"cut":false,"hidden":true,"merged":[]}
["Valve Series","Media","Connection Type","Media Temp. Range (°F)","Max. Inlet Pressure (psig)"]
[599,"Water","NPT",337,300]
[599,"Water","NPT",300,335]
[599,"Water","NPT",250,365]
[599,"Water","NPT",200,385]
[599,"Water","NPT",150,400]
[599,"Water","125# Flanged",337,140]
[599,"Water","125# Flanged",300,165]
[599,"Water","125# Flanged",250,175]
[599,"Water","125# Flanged",200,190]
{"$rows_left_out":19}
{"sheet":"Steam Table","index":7,"n_rows":99,"n_cols":11,"rows_kept":99,"cut":false,"hidden":true,"merged":[]}
["Water Temperature (°F)","Water Enthalpy (Btu/lb)","Water Density (lb/gal)","Water Specific Gravity","Steam Pressure / Vapor Pressure (psig)","Steam Pressure / Vapor Pressure (psia)","Steam Enthalpy (Btu/lb)","Steam Density (lb/ft3)"]
[32,-1.7899999999999999E-2,8.34,{"$f":"C2/$C$9","v":1},{"$f":"F2-14.7","v":-14.610999999999999},8.8999999999999996E-2,1075.5,4.0000000000000002E-4]
[36,4.008,8.35,{"$f":"C3/$C$9","v":1.0011990407673861},{"$f":"F3-14.7","v":-14.596},0.104,1077.2,4.0000000000000002E-4]
[40,8.0269999999999992,8.35,1.0011990407673861,-14.577999999999999,0.122,1079,5.0000000000000001E-4]
[44,12.041,8.34,1,-14.558,0.14199999999999999,1080.7,5.0000000000000001E-4]
[48,16.050999999999998,8.34,1,-14.535,0.16500000000000001,1082.5,5.9999999999999995E-4]
[52,20.056999999999999,8.34,1,-14.507999999999999,0.192,1084.2,5.9999999999999995E-4]
[56,24.059000000000001,8.34,1,-14.478,0.222,1086,6.9999999999999999E-4]
[60,28.06,8.34,1,-14.443999999999999,0.25600000000000001,1087.7,8.0000000000000004E-4]
[64,32.058,8.34,1,-14.404999999999999,0.29499999999999998,1089.5,8.9999999999999998E-4]
{"$rows_left_out":89}